�g���b�NID(�A��),�A���o��ID,�g���b�N�^�C�g��,�g���b�N No.,�g���b�N�t�@�C����(wav),�g���b�N�t�@�C����(mp3),�o�[�W����,�e�g���b�NID,�g���b�N����,�g���b�N������,�L�[���[�h(���{��),�L�[���[�h(�p��),�e���|,�{�[�J���̗L��,�쎌��1,�쎌��2,��ȉ�1 ����,��ȉ�1 �����c��,��ȉ�2 ����,��ȉ�2 �����c��,��ȉ�3 ����,��ȉ�3 �����c��,��ȉ�4 ����,��ȉ�4 �����c��,��ȉ�5 ����,��ȉ�5 �����c��,��ȉ�6 ����,��ȉ�6 �����c��,��ȉ�7 ����,��ȉ�7 �����c��,��ȉ�8 ����,��ȉ�8 �����c��,�o�Ŏ�1 ����,�o�Ŏ�1 �����c��,�o�Ŏ�2 ����,�o�Ŏ�2 �����c��,�o�Ŏ�3 ����,�o�Ŏ�3 �����c��,�o�Ŏ�4 ����,�o�Ŏ�4 �����c��,�o�Ŏ�5 ����,�o�Ŏ�5 �����c��,�o�Ŏ�6 ����,�o�Ŏ�6 �����c��,JASRAC�R�[�h,ISRC�R�[�h,����,�W������ �e����,�W������ �q����,���[�h �e����,���[�h �q����,�J�e�S�� �e����,�J�e�S�� �q����,�y�� �e����,�y�� �q����,�L���� �e����,�L���� ������,�L���� �q����,�N���V�b�N �e����,�N���V�b�N �q����,�폜�t���O
369129,7740,Purity of Life,1,BLINQ135_01_Purity of Life_Full_Mr Roth & R Time & Sander Kerklaan.wav,BLINQ135_01_Purity of Life_Full_Mr Roth & R Time & Sander Kerklaan.mp3,Full,,2:12,"Acoustic, Nature, Garden, Green, Environmental, Home, Family,","�C�[�W�[���X�j���O, ������/���₩, ���R, ���C�t�X�^�C��, �h�L�������^���[, �A�R�[�X�e�B�b�N�M�^�[, �G���N�g���b�N�M�^�[, �A�R�[�X�e�B�b�N�s�A�m, �p�[�J�b�V����, �e���|: ����, ","Acoustic Guitar, Carefree, Calm, Gentle, Documentary, Neutral, Acoustic, Green, Easy Listening, Folk, Garden, Home, Leisure, Family, Nature, Reality Television, Reflective, Warm, Underscore, Light, Minimal, Intimate, Serene, Tender, Wildlife, Panoramic, Landscapes, Storytelling, Peaceful, Delicate, Chillout, Chill, Lazy, Relaxed, Organic, Gardening, Life stories, Environmental Awareness, Autumn, Fall, Spring, Acoustic Guitar, Percussion, Bass, Piano, Ukulele, Mandolin",3,����,,,Mr. Roth,BUMA,R. Time,BUMA,Sander Kerklaan,BUMA,,,,,,,,,,,Blinq Amp Music,BUMA,Blinq Et Music,BUMA,,,,,,,,,,,"�h�L�������^���[, ",32,115,102,3,"8, 10","26, 32","3, 3, 4, 8","16, 17, 27, 62",,,,,,
369130,7740,Purity of Life,2,BLINQ135_02_Purity of Life_No Electric Guitar Swells_Mr Roth & R Time & Sander Kerklaan.wav,BLINQ135_02_Purity of Life_No Electric Guitar Swells_Mr Roth & R Time & Sander Kerklaan.mp3,No Electric Guitar Swells,369129,2:12,"Acoustic, Nature, Garden, Green, Environmental, Home, Family,",,"Acoustic Guitar, Carefree, Calm, Gentle, Documentary, Neutral, Acoustic, Green, Easy Listening, Folk, Garden, Home, Leisure, Family, Nature, Reality Television, Reflective, Warm, Underscore, Light, Minimal, Intimate, Serene, Tender, Wildlife, Panoramic, Landscapes, Storytelling, Peaceful, Delicate, Chillout, Chill, Lazy, Relaxed, Organic, Gardening, Life stories, Environmental Awareness, Autumn, Fall, Spring, Acoustic Guitar, Percussion, Bass, Piano, Ukulele, Mandolin",3,����,,,Mr. Roth,BUMA,R. Time,BUMA,Sander Kerklaan,BUMA,,,,,,,,,,,Blinq Amp Music,BUMA,Blinq Et Music,BUMA,,,,,,,,,,,"�h�L�������^���[, ",32,115,102,3,"8, 10","26, 32","3, 3, 4, 8","16, 17, 27, 62",,,,,,
369131,7740,Purity of Life,3,BLINQ135_03_Purity of Life_No Piano_Mr Roth & R Time & Sander Kerklaan.wav,BLINQ135_03_Purity of Life_No Piano_Mr Roth & R Time & Sander Kerklaan.mp3,No Piano,369129,2:12,"Acoustic, Nature, Garden, Green, Environmental, Home, Family,",,"Acoustic Guitar, Carefree, Calm, Gentle, Documentary, Neutral, Acoustic, Green, Easy Listening, Folk, Garden, Home, Leisure, Family, Nature, Reality Television, Reflective, Warm, Underscore, Light, Minimal, Intimate, Serene, Tender, Wildlife, Panoramic, Landscapes, Storytelling, Peaceful, Delicate, Chillout, Chill, Lazy, Relaxed, Organic, Gardening, Life stories, Environmental Awareness, Autumn, Fall, Spring, Acoustic Guitar, Percussion, Bass, Piano, Ukulele, Mandolin",3,����,,,Mr. Roth,BUMA,R. Time,BUMA,Sander Kerklaan,BUMA,,,,,,,,,,,Blinq Amp Music,BUMA,Blinq Et Music,BUMA,,,,,,,,,,,"�h�L�������^���[, ",32,115,102,3,"8, 10","26, 32","3, 3, 4, 8","16, 17, 27, 62",,,,,,
369132,7740,Purity of Life,4,BLINQ135_04_Purity of Life_No Piano No Guitar Swells_Mr Roth & R Time & Sander Kerklaan.wav,BLINQ135_04_Purity of Life_No Piano No Guitar Swells_Mr Roth & R Time & Sander Kerklaan.mp3,"No Piano, No Guitar Swells",369129,2:12,"Acoustic, Nature, Garden, Green, Environmental, Home, Family,",,"Acoustic Guitar, Carefree, Calm, Gentle, Documentary, Neutral, Acoustic, Green, Easy Listening, Folk, Garden, Home, Leisure, Family, Nature, Reality Television, Reflective, Warm, Underscore, Light, Minimal, Intimate, Serene, Tender, Wildlife, Panoramic, Landscapes, Storytelling, Peaceful, Delicate, Chillout, Chill, Lazy, Relaxed, Organic, Gardening, Life stories, Environmental Awareness, Autumn, Fall, Spring, Acoustic Guitar, Percussion, Bass, Piano, Ukulele, Mandolin",3,����,,,Mr. Roth,BUMA,R. Time,BUMA,Sander Kerklaan,BUMA,,,,,,,,,,,Blinq Amp Music,BUMA,Blinq Et Music,BUMA,,,,,,,,,,,"�h�L�������^���[, ",32,115,102,3,"8, 10","26, 32","3, 3, 4, 8","16, 17, 27, 62",,,,,,
369133,7740,Purity of Life,5,BLINQ135_05_Purity of Life_No Percussion_Mr Roth & R Time & Sander Kerklaan.wav,BLINQ135_05_Purity of Life_No Percussion_Mr Roth & R Time & Sander Kerklaan.mp3,No Percussion,369129,2:12,"Acoustic, Nature, Garden, Green, Environmental, Home, Family,",,"Acoustic Guitar, Carefree, Calm, Gentle, Documentary, Neutral, Acoustic, Green, Easy Listening, Folk, Garden, Home, Leisure, Family, Nature, Reality Television, Reflective, Warm, Underscore, Light, Minimal, Intimate, Serene, Tender, Wildlife, Panoramic, Landscapes, Storytelling, Peaceful, Delicate, Chillout, Chill, Lazy, Relaxed, Organic, Gardening, Life stories, Environmental Awareness, Autumn, Fall, Spring, Acoustic Guitar, Percussion, Bass, Piano, Ukulele, Mandolin",3,����,,,Mr. Roth,BUMA,R. Time,BUMA,Sander Kerklaan,BUMA,,,,,,,,,,,Blinq Amp Music,BUMA,Blinq Et Music,BUMA,,,,,,,,,,,"�h�L�������^���[, ",32,115,102,3,"8, 10","26, 32","3, 3, 4, 8","16, 17, 27, 62",,,,,,
369134,7740,Purity of Life,6,BLINQ135_06_Purity of Life_Light_Mr Roth & R Time & Sander Kerklaan.wav,BLINQ135_06_Purity of Life_Light_Mr Roth & R Time & Sander Kerklaan.mp3,Light,369129,2:12,"Acoustic, Nature, Garden, Green, Environmental, Home, Family,",,"Acoustic Guitar, Carefree, Calm, Gentle, Documentary, Neutral, Acoustic, Green, Easy Listening, Folk, Garden, Home, Leisure, Family, Nature, Reality Television, Reflective, Warm, Underscore, Light, Minimal, Intimate, Serene, Tender, Wildlife, Panoramic, Landscapes, Storytelling, Peaceful, Delicate, Chillout, Chill, Lazy, Relaxed, Organic, Gardening, Life stories, Environmental Awareness, Autumn, Fall, Spring, Acoustic Guitar, Percussion, Bass, Piano, Ukulele, Mandolin",3,����,,,Mr. Roth,BUMA,R. Time,BUMA,Sander Kerklaan,BUMA,,,,,,,,,,,Blinq Amp Music,BUMA,Blinq Et Music,BUMA,,,,,,,,,,,"�h�L�������^���[, ",32,115,102,3,"8, 10","26, 32","3, 3, 4, 8","16, 17, 27, 62",,,,,,
369135,7740,Gentle Beginnings,7,BLINQ135_07_Gentle Beginnings_Full_Mr Roth & R Time & Sander Kerklaan.wav,BLINQ135_07_Gentle Beginnings_Full_Mr Roth & R Time & Sander Kerklaan.mp3,Full,,2:09,"Acoustic, Nature, Garden, Green, Environmental, Home, Family,","�C�[�W�[���X�j���O, ������/���₩, ���R, ���C�t�X�^�C��, �h�L�������^���[, �A�R�[�X�e�B�b�N�M�^�[, �A�R�[�X�e�B�b�N�s�A�m, �V���Z�T�C�U�[, �p�[�J�b�V����, �e���|: ����, ","Acoustic Guitar, Carefree, Calm, Gentle, Documentary, Neutral, Acoustic, Green, Easy Listening, Folk, Garden, Home, Leisure, Family, Nature, Reality Television, Reflective, Warm, Underscore, Light, Minimal, Intimate, Serene, Tender, Wildlife, Panoramic, Landscapes, Storytelling, Peaceful, Delicate, Chillout, Chill, Lazy, Relaxed, Organic, Gardening, Life stories, Environmental Awareness, Autumn, Fall, Spring, Acoustic Guitar, Percussion, Bass, Piano, Ukulele, Mandolin",3,����,,,Mr. Roth,BUMA,R. Time,BUMA,Sander Kerklaan,BUMA,,,,,,,,,,,Blinq Amp Music,BUMA,Blinq Et Music,BUMA,,,,,,,,,,,"�h�L�������^���[, ",32,115,102,3,"8, 10","26, 32","3, 4, 4, 8","16, 27, 29, 62",,,,,,
369136,7740,Gentle Beginnings,8,BLINQ135_08_Gentle Beginnings_No Theme with Harmonics_Mr Roth & R Time & Sander Kerklaan.wav,BLINQ135_08_Gentle Beginnings_No Theme with Harmonics_Mr Roth & R Time & Sander Kerklaan.mp3,No Theme with Harmonics,369135,2:09,"Acoustic, Nature, Garden, Green, Environmental, Home, Family,",,"Acoustic Guitar, Carefree, Calm, Gentle, Documentary, Neutral, Acoustic, Green, Easy Listening, Folk, Garden, Home, Leisure, Family, Nature, Reality Television, Reflective, Warm, Underscore, Light, Minimal, Intimate, Serene, Tender, Wildlife, Panoramic, Landscapes, Storytelling, Peaceful, Delicate, Chillout, Chill, Lazy, Relaxed, Organic, Gardening, Life stories, Environmental Awareness, Autumn, Fall, Spring, Acoustic Guitar, Percussion, Bass, Piano, Ukulele, Mandolin",3,����,,,Mr. Roth,BUMA,R. Time,BUMA,Sander Kerklaan,BUMA,,,,,,,,,,,Blinq Amp Music,BUMA,Blinq Et Music,BUMA,,,,,,,,,,,"�h�L�������^���[, ",32,115,102,3,"8, 10","26, 32","3, 4, 4, 8","16, 27, 29, 62",,,,,,
369137,7740,Gentle Beginnings,9,BLINQ135_09_Gentle Beginnings_No Piano No Theme_Mr Roth & R Time & Sander Kerklaan.wav,BLINQ135_09_Gentle Beginnings_No Piano No Theme_Mr Roth & R Time & Sander Kerklaan.mp3,"No Piano, No Theme",369135,2:09,"Acoustic, Nature, Garden, Green, Environmental, Home, Family,",,"Acoustic Guitar, Carefree, Calm, Gentle, Documentary, Neutral, Acoustic, Green, Easy Listening, Folk, Garden, Home, Leisure, Family, Nature, Reality Television, Reflective, Warm, Underscore, Light, Minimal, Intimate, Serene, Tender, Wildlife, Panoramic, Landscapes, Storytelling, Peaceful, Delicate, Chillout, Chill, Lazy, Relaxed, Organic, Gardening, Life stories, Environmental Awareness, Autumn, Fall, Spring, Acoustic Guitar, Percussion, Bass, Piano, Ukulele, Mandolin",3,����,,,Mr. Roth,BUMA,R. Time,BUMA,Sander Kerklaan,BUMA,,,,,,,,,,,Blinq Amp Music,BUMA,Blinq Et Music,BUMA,,,,,,,,,,,"�h�L�������^���[, ",32,115,102,3,"8, 10","26, 32","3, 4, 4, 8","16, 27, 29, 62",,,,,,
369138,7740,Gentle Beginnings,10,BLINQ135_10_Gentle Beginnings_Basic_Mr Roth & R Time & Sander Kerklaan.wav,BLINQ135_10_Gentle Beginnings_Basic_Mr Roth & R Time & Sander Kerklaan.mp3,Basic,369135,2:09,"Acoustic, Nature, Garden, Green, Environmental, Home, Family,",,"Acoustic Guitar, Carefree, Calm, Gentle, Documentary, Neutral, Acoustic, Green, Easy Listening, Folk, Garden, Home, Leisure, Family, Nature, Reality Television, Reflective, Warm, Underscore, Light, Minimal, Intimate, Serene, Tender, Wildlife, Panoramic, Landscapes, Storytelling, Peaceful, Delicate, Chillout, Chill, Lazy, Relaxed, Organic, Gardening, Life stories, Environmental Awareness, Autumn, Fall, Spring, Acoustic Guitar, Percussion, Bass, Piano, Ukulele, Mandolin",3,����,,,Mr. Roth,BUMA,R. Time,BUMA,Sander Kerklaan,BUMA,,,,,,,,,,,Blinq Amp Music,BUMA,Blinq Et Music,BUMA,,,,,,,,,,,"�h�L�������^���[, ",32,115,102,3,"8, 10","26, 32","3, 4, 4, 8","16, 27, 29, 62",,,,,,
369139,7740,Gentle Beginnings,11,BLINQ135_11_Gentle Beginnings_Light_Mr Roth & R Time & Sander Kerklaan.wav,BLINQ135_11_Gentle Beginnings_Light_Mr Roth & R Time & Sander Kerklaan.mp3,Light,369135,2:09,"Acoustic, Nature, Garden, Green, Environmental, Home, Family,",,"Acoustic Guitar, Carefree, Calm, Gentle, Documentary, Neutral, Acoustic, Green, Easy Listening, Folk, Garden, Home, Leisure, Family, Nature, Reality Television, Reflective, Warm, Underscore, Light, Minimal, Intimate, Serene, Tender, Wildlife, Panoramic, Landscapes, Storytelling, Peaceful, Delicate, Chillout, Chill, Lazy, Relaxed, Organic, Gardening, Life stories, Environmental Awareness, Autumn, Fall, Spring, Acoustic Guitar, Percussion, Bass, Piano, Ukulele, Mandolin",3,����,,,Mr. Roth,BUMA,R. Time,BUMA,Sander Kerklaan,BUMA,,,,,,,,,,,Blinq Amp Music,BUMA,Blinq Et Music,BUMA,,,,,,,,,,,"�h�L�������^���[, ",32,115,102,3,"8, 10","26, 32","3, 4, 4, 8","16, 27, 29, 62",,,,,,
369140,7740,Sublime In Essence,12,BLINQ135_12_Sublime In Essence_Full_Mr Roth & R Time & Sander Kerklaan.wav,BLINQ135_12_Sublime In Essence_Full_Mr Roth & R Time & Sander Kerklaan.mp3,Full,,2:11,"Acoustic, Nature, Garden, Green, Environmental, Home, Family,","�C�[�W�[���X�j���O, ������/���₩, ���R, ���C�t�X�^�C��, �h�L�������^���[, �A�R�[�X�e�B�b�N�M�^�[, �G���N�g���b�N�M�^�[, �A�R�[�X�e�B�b�N�s�A�m, �p�[�J�b�V����, �e���|: ����, ","Acoustic Guitar, Carefree, Calm, Gentle, Documentary, Neutral, Acoustic, Green, Easy Listening, Folk, Garden, Home, Leisure, Family, Nature, Reality Television, Reflective, Warm, Underscore, Light, Minimal, Intimate, Serene, Tender, Wildlife, Panoramic, Landscapes, Storytelling, Peaceful, Delicate, Chillout, Chill, Lazy, Relaxed, Organic, Gardening, Life stories, Environmental Awareness, Autumn, Fall, Spring, Acoustic Guitar, Percussion, Bass, Piano, Ukulele, Mandolin",3,����,,,Mr. Roth,BUMA,R. Time,BUMA,Sander Kerklaan,BUMA,,,,,,,,,,,Blinq Amp Music,BUMA,Blinq Et Music,BUMA,,,,,,,,,,,"�h�L�������^���[, ",32,115,102,3,"8, 10","26, 32","3, 3, 4, 8","16, 17, 27, 62",,,,,,
369141,7740,Sublime In Essence,13,BLINQ135_13_Sublime In Essence_No Guitar Theme_Mr Roth & R Time & Sander Kerklaan.wav,BLINQ135_13_Sublime In Essence_No Guitar Theme_Mr Roth & R Time & Sander Kerklaan.mp3,No Guitar Theme,369140,2:11,"Acoustic, Nature, Garden, Green, Environmental, Home, Family,",,"Acoustic Guitar, Carefree, Calm, Gentle, Documentary, Neutral, Acoustic, Green, Easy Listening, Folk, Garden, Home, Leisure, Family, Nature, Reality Television, Reflective, Warm, Underscore, Light, Minimal, Intimate, Serene, Tender, Wildlife, Panoramic, Landscapes, Storytelling, Peaceful, Delicate, Chillout, Chill, Lazy, Relaxed, Organic, Gardening, Life stories, Environmental Awareness, Autumn, Fall, Spring, Acoustic Guitar, Percussion, Bass, Piano, Ukulele, Mandolin",3,����,,,Mr. Roth,BUMA,R. Time,BUMA,Sander Kerklaan,BUMA,,,,,,,,,,,Blinq Amp Music,BUMA,Blinq Et Music,BUMA,,,,,,,,,,,"�h�L�������^���[, ",32,115,102,3,"8, 10","26, 32","3, 3, 4, 8","16, 17, 27, 62",,,,,,
369142,7740,Sublime In Essence,14,BLINQ135_14_Sublime In Essence_No Reversed FX_Mr Roth & R Time & Sander Kerklaan.wav,BLINQ135_14_Sublime In Essence_No Reversed FX_Mr Roth & R Time & Sander Kerklaan.mp3,No Reversed FX,369140,2:11,"Acoustic, Nature, Garden, Green, Environmental, Home, Family,",,"Acoustic Guitar, Carefree, Calm, Gentle, Documentary, Neutral, Acoustic, Green, Easy Listening, Folk, Garden, Home, Leisure, Family, Nature, Reality Television, Reflective, Warm, Underscore, Light, Minimal, Intimate, Serene, Tender, Wildlife, Panoramic, Landscapes, Storytelling, Peaceful, Delicate, Chillout, Chill, Lazy, Relaxed, Organic, Gardening, Life stories, Environmental Awareness, Autumn, Fall, Spring, Acoustic Guitar, Percussion, Bass, Piano, Ukulele, Mandolin",3,����,,,Mr. Roth,BUMA,R. Time,BUMA,Sander Kerklaan,BUMA,,,,,,,,,,,Blinq Amp Music,BUMA,Blinq Et Music,BUMA,,,,,,,,,,,"�h�L�������^���[, ",32,115,102,3,"8, 10","26, 32","3, 3, 4, 8","16, 17, 27, 62",,,,,,
369143,7740,Sublime In Essence,15,BLINQ135_15_Sublime In Essence_No Percussion_Mr Roth & R Time & Sander Kerklaan.wav,BLINQ135_15_Sublime In Essence_No Percussion_Mr Roth & R Time & Sander Kerklaan.mp3,No Percussion,369140,2:11,"Acoustic, Nature, Garden, Green, Environmental, Home, Family,",,"Acoustic Guitar, Carefree, Calm, Gentle, Documentary, Neutral, Acoustic, Green, Easy Listening, Folk, Garden, Home, Leisure, Family, Nature, Reality Television, Reflective, Warm, Underscore, Light, Minimal, Intimate, Serene, Tender, Wildlife, Panoramic, Landscapes, Storytelling, Peaceful, Delicate, Chillout, Chill, Lazy, Relaxed, Organic, Gardening, Life stories, Environmental Awareness, Autumn, Fall, Spring, Acoustic Guitar, Percussion, Bass, Piano, Ukulele, Mandolin",3,����,,,Mr. Roth,BUMA,R. Time,BUMA,Sander Kerklaan,BUMA,,,,,,,,,,,Blinq Amp Music,BUMA,Blinq Et Music,BUMA,,,,,,,,,,,"�h�L�������^���[, ",32,115,102,3,"8, 10","26, 32","3, 3, 4, 8","16, 17, 27, 62",,,,,,
369144,7740,Sublime In Essence,16,BLINQ135_16_Sublime In Essence_Light_Mr Roth & R Time & Sander Kerklaan.wav,BLINQ135_16_Sublime In Essence_Light_Mr Roth & R Time & Sander Kerklaan.mp3,Light,369140,2:11,"Acoustic, Nature, Garden, Green, Environmental, Home, Family,",,"Acoustic Guitar, Carefree, Calm, Gentle, Documentary, Neutral, Acoustic, Green, Easy Listening, Folk, Garden, Home, Leisure, Family, Nature, Reality Television, Reflective, Warm, Underscore, Light, Minimal, Intimate, Serene, Tender, Wildlife, Panoramic, Landscapes, Storytelling, Peaceful, Delicate, Chillout, Chill, Lazy, Relaxed, Organic, Gardening, Life stories, Environmental Awareness, Autumn, Fall, Spring, Acoustic Guitar, Percussion, Bass, Piano, Ukulele, Mandolin",3,����,,,Mr. Roth,BUMA,R. Time,BUMA,Sander Kerklaan,BUMA,,,,,,,,,,,Blinq Amp Music,BUMA,Blinq Et Music,BUMA,,,,,,,,,,,"�h�L�������^���[, ",32,115,102,3,"8, 10","26, 32","3, 3, 4, 8","16, 17, 27, 62",,,,,,
369145,7740,Beauty Beyond Boundaries,17,BLINQ135_17_Beauty Beyond Boundaries_Full_Mr Roth & R Time & Sander Kerklaan.wav,BLINQ135_17_Beauty Beyond Boundaries_Full_Mr Roth & R Time & Sander Kerklaan.mp3,Full,,2:06,"Acoustic, Nature, Garden, Green, Environmental, Home, Family,

Groove Playlists: <a href=""/search/result/?keyword=GR�H���a"">GR�H���a""</a>","�C�[�W�[���X�j���O, ������/���₩, ���R, ���C�t�X�^�C��, �h�L�������^���[, �A�R�[�X�e�B�b�N�M�^�[, �X�g�����O�E�Z�N�V����, �G���N�g���b�N�M�^�[, �p�[�J�b�V����, �e���|: ����, ","Acoustic Guitar, Carefree, Calm, Gentle, Documentary, Neutral, Acoustic, Green, Easy Listening, Folk, Garden, Home, Leisure, Family, Nature, Reality Television, Reflective, Warm, Underscore, Light, Minimal, Intimate, Serene, Tender, Wildlife, Panoramic, Landscapes, Storytelling, Peaceful, Delicate, Chillout, Chill, Lazy, Relaxed, Organic, Gardening, Life stories, Environmental Awareness, Autumn, Fall, Spring, Acoustic Guitar, Percussion, Bass, Piano, Ukulele, Mandolin",3,����,,,Mr. Roth,BUMA,R. Time,BUMA,Sander Kerklaan,BUMA,,,,,,,,,,,Blinq Amp Music,BUMA,Blinq Et Music,BUMA,,,,,,,,,,,"�h�L�������^���[, ",32,115,102,3,"8, 10","26, 32","3, 5, 3, 8","16, 37, 17, 62",,,,,,
369146,7740,Beauty Beyond Boundaries,18,BLINQ135_18_Beauty Beyond Boundaries_No Theme_Mr Roth & R Time & Sander Kerklaan.wav,BLINQ135_18_Beauty Beyond Boundaries_No Theme_Mr Roth & R Time & Sander Kerklaan.mp3,No Theme,369145,2:06,"Acoustic, Nature, Garden, Green, Environmental, Home, Family,",,"Acoustic Guitar, Carefree, Calm, Gentle, Documentary, Neutral, Acoustic, Green, Easy Listening, Folk, Garden, Home, Leisure, Family, Nature, Reality Television, Reflective, Warm, Underscore, Light, Minimal, Intimate, Serene, Tender, Wildlife, Panoramic, Landscapes, Storytelling, Peaceful, Delicate, Chillout, Chill, Lazy, Relaxed, Organic, Gardening, Life stories, Environmental Awareness, Autumn, Fall, Spring, Acoustic Guitar, Percussion, Bass, Piano, Ukulele, Mandolin",3,����,,,Mr. Roth,BUMA,R. Time,BUMA,Sander Kerklaan,BUMA,,,,,,,,,,,Blinq Amp Music,BUMA,Blinq Et Music,BUMA,,,,,,,,,,,"�h�L�������^���[, ",32,115,102,3,"8, 10","26, 32","3, 5, 3, 8","16, 37, 17, 62",,,,,,
369147,7740,Beauty Beyond Boundaries,19,BLINQ135_19_Beauty Beyond Boundaries_No Strings_Mr Roth & R Time & Sander Kerklaan.wav,BLINQ135_19_Beauty Beyond Boundaries_No Strings_Mr Roth & R Time & Sander Kerklaan.mp3,No Strings,369145,2:06,"Acoustic, Nature, Garden, Green, Environmental, Home, Family,",,"Acoustic Guitar, Carefree, Calm, Gentle, Documentary, Neutral, Acoustic, Green, Easy Listening, Folk, Garden, Home, Leisure, Family, Nature, Reality Television, Reflective, Warm, Underscore, Light, Minimal, Intimate, Serene, Tender, Wildlife, Panoramic, Landscapes, Storytelling, Peaceful, Delicate, Chillout, Chill, Lazy, Relaxed, Organic, Gardening, Life stories, Environmental Awareness, Autumn, Fall, Spring, Acoustic Guitar, Percussion, Bass, Piano, Ukulele, Mandolin",3,����,,,Mr. Roth,BUMA,R. Time,BUMA,Sander Kerklaan,BUMA,,,,,,,,,,,Blinq Amp Music,BUMA,Blinq Et Music,BUMA,,,,,,,,,,,"�h�L�������^���[, ",32,115,102,3,"8, 10","26, 32","3, 5, 3, 8","16, 37, 17, 62",,,,,,
369148,7740,Beauty Beyond Boundaries,20,BLINQ135_20_Beauty Beyond Boundaries_No Electric Guitar_Mr Roth & R Time & Sander Kerklaan.wav,BLINQ135_20_Beauty Beyond Boundaries_No Electric Guitar_Mr Roth & R Time & Sander Kerklaan.mp3,No Electric Guitar,369145,2:06,"Acoustic, Nature, Garden, Green, Environmental, Home, Family,",,"Acoustic Guitar, Carefree, Calm, Gentle, Documentary, Neutral, Acoustic, Green, Easy Listening, Folk, Garden, Home, Leisure, Family, Nature, Reality Television, Reflective, Warm, Underscore, Light, Minimal, Intimate, Serene, Tender, Wildlife, Panoramic, Landscapes, Storytelling, Peaceful, Delicate, Chillout, Chill, Lazy, Relaxed, Organic, Gardening, Life stories, Environmental Awareness, Autumn, Fall, Spring, Acoustic Guitar, Percussion, Bass, Piano, Ukulele, Mandolin",3,����,,,Mr. Roth,BUMA,R. Time,BUMA,Sander Kerklaan,BUMA,,,,,,,,,,,Blinq Amp Music,BUMA,Blinq Et Music,BUMA,,,,,,,,,,,"�h�L�������^���[, ",32,115,102,3,"8, 10","26, 32","3, 5, 3, 8","16, 37, 17, 62",,,,,,
369149,7740,Beauty Beyond Boundaries,21,BLINQ135_21_Beauty Beyond Boundaries_No Ukulele_Mr Roth & R Time & Sander Kerklaan.wav,BLINQ135_21_Beauty Beyond Boundaries_No Ukulele_Mr Roth & R Time & Sander Kerklaan.mp3,No Ukulele,369145,2:06,"Acoustic, Nature, Garden, Green, Environmental, Home, Family,",,"Acoustic Guitar, Carefree, Calm, Gentle, Documentary, Neutral, Acoustic, Green, Easy Listening, Folk, Garden, Home, Leisure, Family, Nature, Reality Television, Reflective, Warm, Underscore, Light, Minimal, Intimate, Serene, Tender, Wildlife, Panoramic, Landscapes, Storytelling, Peaceful, Delicate, Chillout, Chill, Lazy, Relaxed, Organic, Gardening, Life stories, Environmental Awareness, Autumn, Fall, Spring, Acoustic Guitar, Percussion, Bass, Piano, Ukulele, Mandolin",3,����,,,Mr. Roth,BUMA,R. Time,BUMA,Sander Kerklaan,BUMA,,,,,,,,,,,Blinq Amp Music,BUMA,Blinq Et Music,BUMA,,,,,,,,,,,"�h�L�������^���[, ",32,115,102,3,"8, 10","26, 32","3, 5, 3, 8","16, 37, 17, 62",,,,,,
369150,7740,Pure and Natural,22,BLINQ135_22_Pure and Natural_Full_Mr Roth & R Time & Sander Kerklaan.wav,BLINQ135_22_Pure and Natural_Full_Mr Roth & R Time & Sander Kerklaan.mp3,Full,,2:06,"Acoustic, Nature, Garden, Green, Environmental, Home, Family,","�C�[�W�[���X�j���O, ������/���₩, ���R, ���C�t�X�^�C��, �h�L�������^���[, �A�R�[�X�e�B�b�N�M�^�[, �A�R�[�X�e�B�b�N�s�A�m, �X�`�[���M�^�[, �p�[�J�b�V����, �e���|: ����, ","Acoustic Guitar, Carefree, Calm, Gentle, Documentary, Neutral, Acoustic, Green, Easy Listening, Folk, Garden, Home, Leisure, Family, Nature, Reality Television, Reflective, Warm, Underscore, Light, Minimal, Intimate, Serene, Tender, Wildlife, Panoramic, Landscapes, Storytelling, Peaceful, Delicate, Chillout, Chill, Lazy, Relaxed, Organic, Gardening, Life stories, Environmental Awareness, Autumn, Fall, Spring, Acoustic Guitar, Percussion, Bass, Piano, Lap steel guitar, Ukulele, Mandolin",3,����,,,Mr. Roth,BUMA,R. Time,BUMA,Sander Kerklaan,BUMA,,,,,,,,,,,Blinq Amp Music,BUMA,Blinq Et Music,BUMA,,,,,,,,,,,"�h�L�������^���[, ",32,115,102,3,"8, 10","26, 32","3, 4, 3, 8","16, 27, 19, 62",,,,,,